Fazer uma pergunta:


» Categoria: Erros comuns que ocorrem na chamada da DLL  (Voltar)

» Artigos nesta categoria:

 
5206 - Erro: Ocorreu um erro de validação do XML [WS2.xml] Classificações de artigo 4.4/5.0
"5206 - Erro: Ocorreu um erro de validação do XML [WS2.xml] : [Referência de objeto não definida para uma instância de um objeto.]" Este erro acontece quando a versão do arquivo WS2.xml q...
Erro: XML mal formado - Valor não pode ser nulo. Classificações de artigo 3.6/5.0
Erro: XML mal formado - Valor não pode ser nulo. Nome do parâmetro: key Este erro pode ocorrer quando não é informado nenhum valor para o parâmetro "RefUri" (tag que será assinada ) da fu...
7101 - Erro: Tentativa de enviar e-mail falhou: [System.Net.Smtp.Exception: Nome da caixa de correio não permitido. Classificações de artigo 4.2/5.0
7101 - Erro: Tentativa de enviar e-mail falhou: [System.Net.Smtp.Exception: Nome da caixa de correio não permitido. A resposta do Servidor foi: From address not verified - see... O Erro "Nome ...
run-time error '-2147024894 (80070002)' Classificações de artigo 4.6/5.0
O erro run-time error '-2147024894 (80070002)' ocorre quando tentamos instanciar a DLL e a mesma não existe na pasta da aplicação. A solução é providenciar a cópia da DLL e as pastas URL, Schemas e...
GPF ao chamar a DLL NFe_Util - Harbour e xHarbour Classificações de artigo 3.9/5.0
O usuário que tem o Harbour como ambiente de programação reporta que passou a ter GPF em Windows XP com a nova versão da DLL. O problema não acontece se utilizado em Windows Vista. A solução do...
Ole Error 80070002 ou Ole Error 80040002 Classificações de artigo 3.9/5.0
O erro "Ole Error 80070002 ou Ole Error 80040002" ocorre quando tentamos instanciar a DLL e a mesma não existe na pasta da aplicação. A solução é providenciar a cópia da DLL e as pastas U...
OLE error code 0x8000401f3 Invalid class string Classificações de artigo 4.2/5.0
A causa do erro "OLE error code 0x8000401f3 Invalid class string" é devido o nome incorreto da classe que (invalid class string). Para instanciar a NFe_Util.dll, queira utilizar: obj =...
Erro 2146234304 (80131040) Classificações de artigo 3.1/5.0
O erro "Ole Error 80231040" ou "Ole Error 80131040" que ocorre na chamada da DLL NFe_Util é causada pela divergência da versão da DLL existente na pasta do aplicativo em relação à ...
Ole Error 80231040 ou Ole Error 80131040 Classificações de artigo 3.7/5.0
O erro "Ole Error 80231040" ou "Ole Error 80131040" que ocorre na chamada da DLL NFe_Util é causada pela divergência da versão da DLL existente na pasta do aplicativo em relação à ...
Aplicativo não iniciado corretamente (0xC0000135) Classificações de artigo 4.0/5.0
A mensagem "Aplicativo não iniciado corretamente (0xC0000135)" ocorre no momento de execução registraDLL ou do aplicativo regasm.exe para registro da DLL. A instalação do Framework .NET 2...
Run-time error 21462330306 (80131534) Classificações de artigo 5.0/5.0
O erro Run-time error 21462330306 (80131534)' ocorre quando executamos a aplicação em drive mapeado de rede. Não existe garantia que a DLL funcione no drive mapeado de rede, mas a muitos usuários t...
OLE error 8013141A Classificações de artigo 4.2/5.0
"OLE error 8013141A" Este código de erro indica que a DLL teve alguma alteração de conteúdo. Tente substituir a DLL, caso dê certo, o equipamento pode estar com algum vírus.
Classe não registrada Classificações de artigo 4.6/5.0
A mensagem "Classe não registrada" indica que a DLL NFe_Util não foi corretamente registrada no equipamento. O registro da DLL deve solucionar o problema. Para maiores detalhes do proc...
A chave informada [] tamanho [] é inválida para o CNPJ [] Classificações de artigo 4.0/5.0
"A chave informada [xxxxx] tamanho[nnn] é inválida para o CNPJ [cccccccccccccc] Tamanho [nn]" O uso da DLL em ambiente de homologação é livre e não existe qualquer restrição de uso ou d...
5307 - Erro: Falha na Assinatura: [mensagem...] Classificações de artigo 3.5/5.0
"5307 - Erro: Falha na Assinatura: [{0:0}] O erro 5307 é causado por um mal funcionamento do cerficado digital, que pode não ter sido corretamente instalado ou não estar disponível para uso s...
Ole Error 80131537 Classificações de artigo 5.0/5.0
Ole Error 80131537 Este erro pode ocorrer quando acessamos a DLL via late binding (http://www.flexdocs.com.br/guiaNFe/uso.html) Na chamada late binding, a validação da consistência da quantidade...
System.OutOfMemoryException 2147024882 (8007000e) Classificações de artigo 4.6/5.0
System.OutOfMemoryException Error 2147024882 (8007000e) Este erro ocorre principalmente com DELPHI quando atualizamos a versão da DLL e não fazemos o type impor library novamente. Em VB é nec...
5014 - Erro: Falha na conexão: [A resposta não é um XML bem-formado.] Classificações de artigo 4.4/5.0
5014 - Erro: Falha na conexão: [A resposta não é um XML bem-formado.] Este erro tem acontecido na SEFA/PR com alguma frequência, por algum motivo desconhecido, a mensagem de retorno do WS da SEFA/P...
run-time error 2146232576(80131700) Automation error Classificações de artigo 3.0/5.0
Este erro ocorre quando houve algum problema na instalação/registro da DLL MSSTDFMT.DLL necessária para acesso ao Banco de Dados via ADO. Para solucionar o problema faça o seguinte: - Desregist...
Seqüência de entrada não estava em um formato incorreto Classificações de artigo 4.0/5.0
Sequência de entrada não estava em um formato incorreto 6905 - Erro: erro inesperado no tratamento do txt de entrada. [Seqüência de entrada não estava em um formato incorreto.] ou 6905 - Err...
Input string was not in a correct format Classificações de artigo 4.3/5.0
6905 - Erro: erro inesperado no tratamento do txt de entrada. [Input string was not in a correct format.] ou 6905 - Erro: erro inesperado no tratamento do txt de entrada. [Seqüência de entrada n...
Não foi possível carregar arquivo ou assembly 'NFe_Util_2G' Classificações de artigo 3.4/5.0
"Não foi possível carregar arquivo ou assembly 'NFe_Util_2G', (...) Foi feita uma tentativa de se carregar um programa com um formato incorreto" Este erro pode ocorrer em um ambiente com ...
5204 Erro: Arquivo WSNFSE.XML com a URL do WS não localizado Classificações de artigo 4.3/5.0
"5204 Erro: Arquivo WSNFSE.XML com a URL do WS não localizado em [path da pasta]" O erro acima ocorre quando a DLL tenta localizar o arquivo wsNFSe.xml que contem as url dos Web Services...
Component 'COMDLG32.OCX' or one of its dependencies not correctly registred: a file is missing or invalid Classificações de artigo 4.6/5.0
Component 'COMDLG32.OCX' or one of its dependencies not correctly registred: a file is missing or invalid Este erro acontece quando o usuário tenta executar o demo VB 6.0 em um equipamento que não ...
Run-time error '430' - classe does not support Automation or does not support expected interface Classificações de artigo 4.3/5.0
Run-time error '430' classe does not support Automation or does not support expected interface O erro acima foi reportado por usuário que encontrou a solução no seguinte link: http://scriptbr...
Configuration System Failed to Initialize Classificações de artigo 4.6/5.0
"Configuration System Failed to Initialize" A causa deve ser o arquivo machine.config.xml que existe na pasta: C:\Windows\Microsoft.NET\Framework\v2.0.50727\CONFIG Não sabemos ao ...
Restrição do empacotador: seqüência de caracteres muito longa Classificações de artigo 4.6/5.0
"exception class EOleException with message 'Restrição do empacotador: seqüência de caracteres " A mensagem acima pode ocorrer quando o usuário atualiza a DLL, mas não gera a nova unit ...
Exceção System.ExecutionEngineException Classificações de artigo 4.2/5.0
A exceção System.ExecutionEngineException pode ocorrer quando o usuário utiliza o ReportViewer do Microsoft. Solicite uma versão específica da DLL para o suporte da FlexDocs. OBS. IMPORTANTE.: ...
OleSysError : Não há suporte para esta interface. Classificações de artigo 3.8/5.0
"OleSysError : Não há suporte para esta interface." Este erro pode ocorrer quando o tipo do parâmetro de chamada da DLL é diferente do tipo esperado pela DLL. Ex.: A DLL espera um parâ...
5014 - Erro: Falha na conexão: [The remote name could not be resolved: ....] Classificações de artigo 4.3/5.0
"5014 - Erro: Falha na conexão: [The remote name could not be resolved: ....]" Este erro ocorre quando existe algum problema no acesso à internet. Já tivemos reporte de problemas que s...
7101-Erro Tentativa de enviar e-mail falhou Classificações de artigo 3.0/5.0
"7101 - Erro: Tentativa de enviar e-mail falhou: [System.Net.Mail.SmtpException: Falha ao enviar email --> System.Net.Mail.SmtpException: Impossível conectar ao servidor remoto --> System.N...
Object reference not set to an instance of an object Classificações de artigo 3.4/5.0
"Object reference not set to an instance of an object" ou "Referência de objeto não definida para uma instância de um objeto" Este erro ocorre quando a DLL tenta aces...
5014 - Erro: Falha na conexão:[This operation is only supported on Windows 2000 SP3 or later operating systems.] Classificações de artigo 3.1/5.0
5014 - Erro: Falha na conexão: Mensagem Erro do Windows=[This operation is only supported on Windows 2000 SP3 or later operating systems.] (Causa provável: Web Service não consumido, veja a causa do e...
7101 - Erro: Tentativa de enviar e-mail falhou: [System.Net.Smtp.Exception: Classificações de artigo 3.7/5.0
7101 - Erro: Tentativa de enviar e-mail falhou: [System.Net.Smtp.Exception: Caixa de Correio não disponível. A resposta do Servidor foi: 5.7.3 Requested action aborted; user not authenticated... O ...
NFe_util_2G.util/-2147352573 DISP_E_MEMBERNOTFOUND: Classificações de artigo 4.6/5.0
O erro: NFe_util_2G.util/-2147352573 DISP_E_MEMBERNOTFOUND: [nome funcionalidade] pode ocorrer com usuários que fazem a integração com a DLL via late binding (xHarbour, Harbour, VFP, etc.). ...
BadImageFormatException was unhandled: Could not load file or assembly 'NFe_Util, Version=1.4.0.5, Culture=neutral Classificações de artigo 4.0/5.0
BadImageFormatException was unhandled: Could not load file or assembly 'NFe_Util, Version=1.4.0.5, Culture=neutral, PublicKeyToken=6cf060598d0e49c2' or one of its dependencies. An attempt was made to...
com Cupom Fiscal referenciado Classificações de artigo 4.6/5.0
<ide> <cUF>35</cUF> <cNF>00000001</cNF> <natOp>Venda</natOp> <indPag>1</indPag> <mod>55</mod> <serie>0</ser...
6214-Erro: da NF-e [{0:0}] diverge do do protocolo [{1:0}] Classificações de artigo 3.2/5.0
6214-Erro: da NF-e [{0:0}] diverge do do protocolo [{1:0}] Tanto a funcionalidade BuscaNFe2G como a funcionalidade criaProcNFe2G não montam o arquivo procNFe quando existe divergência no DigestValu...
7101 - Erro: Tentativa de enviar e-mail falhou: [System.FormatException: A seqüência de caracteres especificada não está no formato necessário para um endereço de e-mail. Classificações de artigo 3.9/5.0
"7101 - Erro: Tentativa de enviar e-mail falhou: [System.FormatException: A seqüência de caracteres especificada não está no formato necessário para um endereço de e-mail." O erro acima p...
Run-time error '430' classe does not support Automation or does not support expected interface Classificações de artigo 4.2/5.0
Run-time error '430' classe does not support Automation or does not support expected interface O erro acima foi reportado por usuário que encontrou a solução no seguinte link: http://scriptbrasi...
unable to automatically step into the server Classificações de artigo 4.6/5.0
"unable to automatically step into the server (...)" Este erro pode acontecer quando o usuário tenta debugar a aplicação em .NET (c#, VB.NET, etc) com o STEP INTO (F11) na chamada da DLL....
438 - object doesn´t support this property or method. Classificações de artigo 4.6/5.0
"Run-time erro '438' object doesn´t support this property or method." Este erro acontece quando tentamos invocar um método inexistente na DLL. A causa pode ser o erro na grafia do méto...
Erro no CriaProcNFe2G Classificações de artigo 3.3/5.0
5505 - Erro: XML não atende a especificação do Schema XML, analise a lista de erros: [1 - Linha:0001 Coluna:0016 Campo: Conteúdo: Erro:O atributo 'versao' é inválido - O valor '2.01' é inválido depend...
run-time error 429: ActiveX component can't create object Classificações de artigo 3.4/5.0
run-time error 429: ActiveX component can't create object A principal causa do erro 429 é falha na instalação (registro da DLL). Para realizar o registro do Windows no Windows 7, Vista, 8 é nec...
Problemas no Envio de E-mail LocaWeb Classificações de artigo 4.6/5.0
Problemas no Envio de E-mail LocaWeb Existem casos de que o envio de e-mail através da conta do provedor LocaWeb é realizado com sucesso, no entanto, o destinatário não o recebe. Existe um filtr...
6413 - Erro: <DigestValue> da NF-e:[{0:0}] diverge do <digVal> do protocolo: [{1:0}] Classificações de artigo 4.2/5.0
6413 - Erro: <DigestValue> da NF-e:[{0:0}] diverge do <digVal> do protocolo: [{1:0}] Tanto a funcionalidade BuscaNFe2G como a funcionalidade criaProcNFe2G não montam o arquivo procNFe ...